{"text_format":"1","workbook":"xlsx","n_sheets":2,"sheets":["FORMULARIO","APOYO"],"not_rendered":{"charts":0,"images":1,"macros":1,"external_links":0,"defined_names":0,"comments":0,"pivot_tables":0},"unopened":[],"bounds":{"document_bytes":16777216,"sheet_cells":100000,"rows_first":2000,"rows_last":500,"rows_between":2000,"halvings":0,"cell_chars":16384,"cell_head_chars":4096},"cells_cut":0,"cells_raw":0,"read":"whole","date_system":"1900"}

{"sheet":"FORMULARIO","index":0,"n_rows":58,"n_cols":24,"rows_kept":58,"cut":false,"hidden":false,"merged":[[1,3,3,23],[5,1,5,2],[5,3,5,8],[5,9,5,10],[5,11,5,15],[5,16,5,23]]}
[]
[null,null,null,"FORMULARIO DE DECLARACIÓN DE REMUNERACIONES PAGADAS A PERSONAS ESTRATÉGICAS DEL SFPS"]
[]
[]
[]
[null,"Información de la organización",null,"Información de la persona estratégica",null,null,null,null,null,"Periodo del ejercicio",null,"Información de contacto",null,null,null,null,"Información remunerativa"]
["FECHA DE CORTE","RUC","RAZÓN SOCIAL","CARGO","CÉDULA / RUC","PRIMER APELLIDO / RAZÓN SOCIAL","SEGUNDO APELLIDO","PRIMER NOMBRE / RAZÓN SOCIAL","SEGUNDO NOMBRE","FECHA INICIO","FECHA FIN","TELÉFONO DE LA ENTIDAD","TELÉFONO DE DOMICILIO","TELÉFONO CELULAR","CORREO ELECTRÓNICO INSTITUCIONAL","CORREO ELECTRÓNICO PERSONAL","MODALIDAD","SUELDO ANUAL","HORAS EXTRAS ANUAL","VIÁTICOS Y SUBSISTENCIAS ANUAL","GASTOS DE REPRESENTACIÓN ANUAL","BONOS ANUAL","OTROS INGRESOS ANUAL","VACACIONES ANUAL"]
[null,null,{"$f":"IF(Tabla1[[#This Row],[RUC]]<>\"\", IFERROR(VLOOKUP(Tabla1[[#This Row],[RUC]], APOYO!G:H, 2, 0),\"RUC NO EXISTE\"),\"\")","v":""}]
[null,null,{"$f":"IF(Tabla1[[#This Row],[RUC]]<>\"\", IFERROR(VLOOKUP(Tabla1[[#This Row],[RUC]], APOYO!G:H, 2, 0),\"RUC NO EXISTE\"),\"\")","v":""}]
[null,null,{"$f":"IF(Tabla1[[#This Row],[RUC]]<>\"\", IFERROR(VLOOKUP(Tabla1[[#This Row],[RUC]], APOYO!G:H, 2, 0),\"RUC NO EXISTE\"),\"\")","v":""}]
[null,null,{"$f":"IF(Tabla1[[#This Row],[RUC]]<>\"\", IFERROR(VLOOKUP(Tabla1[[#This Row],[RUC]], APOYO!G:H, 2, 0),\"RUC NO EXISTE\"),\"\")","v":""}]
[null,null,{"$f":"IF(Tabla1[[#This Row],[RUC]]<>\"\", IFERROR(VLOOKUP(Tabla1[[#This Row],[RUC]], APOYO!G:H, 2, 0),\"RUC NO EXISTE\"),\"\")","v":""}]
[null,null,{"$f":"IF(Tabla1[[#This Row],[RUC]]<>\"\", IFERROR(VLOOKUP(Tabla1[[#This Row],[RUC]], APOYO!G:H, 2, 0),\"RUC NO EXISTE\"),\"\")","v":""}]
[null,null,{"$f":"IF(Tabla1[[#This Row],[RUC]]<>\"\", IFERROR(VLOOKUP(Tabla1[[#This Row],[RUC]], APOYO!G:H, 2, 0),\"RUC NO EXISTE\"),\"\")","v":""}]
[null,null,{"$f":"IF(Tabla1[[#This Row],[RUC]]<>\"\", IFERROR(VLOOKUP(Tabla1[[#This Row],[RUC]], APOYO!G:H, 2, 0),\"RUC NO EXISTE\"),\"\")","v":""}]
[null,null,{"$f":"IF(Tabla1[[#This Row],[RUC]]<>\"\", IFERROR(VLOOKUP(Tabla1[[#This Row],[RUC]], APOYO!G:H, 2, 0),\"RUC NO EXISTE\"),\"\")","v":""}]
[null,null,{"$f":"IF(Tabla1[[#This Row],[RUC]]<>\"\", IFERROR(VLOOKUP(Tabla1[[#This Row],[RUC]], APOYO!G:H, 2, 0),\"RUC NO EXISTE\"),\"\")","v":""}]
[null,null,{"$f":"IF(Tabla1[[#This Row],[RUC]]<>\"\", IFERROR(VLOOKUP(Tabla1[[#This Row],[RUC]], APOYO!G:H, 2, 0),\"RUC NO EXISTE\"),\"\")","v":""}]
[null,null,{"$f":"IF(Tabla1[[#This Row],[RUC]]<>\"\", IFERROR(VLOOKUP(Tabla1[[#This Row],[RUC]], APOYO!G:H, 2, 0),\"RUC NO EXISTE\"),\"\")","v":""}]
[null,null,{"$f":"IF(Tabla1[[#This Row],[RUC]]<>\"\", IFERROR(VLOOKUP(Tabla1[[#This Row],[RUC]], APOYO!G:H, 2, 0),\"RUC NO EXISTE\"),\"\")","v":""}]
[null,null,{"$f":"IF(Tabla1[[#This Row],[RUC]]<>\"\", IFERROR(VLOOKUP(Tabla1[[#This Row],[RUC]], APOYO!G:H, 2, 0),\"RUC NO EXISTE\"),\"\")","v":""}]
[null,null,{"$f":"IF(Tabla1[[#This Row],[RUC]]<>\"\", IFERROR(VLOOKUP(Tabla1[[#This Row],[RUC]], APOYO!G:H, 2, 0),\"RUC NO EXISTE\"),\"\")","v":""}]
[null,null,{"$f":"IF(Tabla1[[#This Row],[RUC]]<>\"\", IFERROR(VLOOKUP(Tabla1[[#This Row],[RUC]], APOYO!G:H, 2, 0),\"RUC NO EXISTE\"),\"\")","v":""}]
[null,null,{"$f":"IF(Tabla1[[#This Row],[RUC]]<>\"\", IFERROR(VLOOKUP(Tabla1[[#This Row],[RUC]], APOYO!G:H, 2, 0),\"RUC NO EXISTE\"),\"\")","v":""}]
[null,null,{"$f":"IF(Tabla1[[#This Row],[RUC]]<>\"\", IFERROR(VLOOKUP(Tabla1[[#This Row],[RUC]], APOYO!G:H, 2, 0),\"RUC NO EXISTE\"),\"\")","v":""}]
[null,null,{"$f":"IF(Tabla1[[#This Row],[RUC]]<>\"\", IFERROR(VLOOKUP(Tabla1[[#This Row],[RUC]], APOYO!G:H, 2, 0),\"RUC NO EXISTE\"),\"\")","v":""}]
[null,null,{"$f":"IF(Tabla1[[#This Row],[RUC]]<>\"\", IFERROR(VLOOKUP(Tabla1[[#This Row],[RUC]], APOYO!G:H, 2, 0),\"RUC NO EXISTE\"),\"\")","v":""}]
[null,null,{"$f":"IF(Tabla1[[#This Row],[RUC]]<>\"\", IFERROR(VLOOKUP(Tabla1[[#This Row],[RUC]], APOYO!G:H, 2, 0),\"RUC NO EXISTE\"),\"\")","v":""}]
[null,null,{"$f":"IF(Tabla1[[#This Row],[RUC]]<>\"\", IFERROR(VLOOKUP(Tabla1[[#This Row],[RUC]], APOYO!G:H, 2, 0),\"RUC NO EXISTE\"),\"\")","v":""}]
[null,null,{"$f":"IF(Tabla1[[#This Row],[RUC]]<>\"\", IFERROR(VLOOKUP(Tabla1[[#This Row],[RUC]], APOYO!G:H, 2, 0),\"RUC NO EXISTE\"),\"\")","v":""}]
[null,null,{"$f":"IF(Tabla1[[#This Row],[RUC]]<>\"\", IFERROR(VLOOKUP(Tabla1[[#This Row],[RUC]], APOYO!G:H, 2, 0),\"RUC NO EXISTE\"),\"\")","v":""}]
[null,null,{"$f":"IF(Tabla1[[#This Row],[RUC]]<>\"\", IFERROR(VLOOKUP(Tabla1[[#This Row],[RUC]], APOYO!G:H, 2, 0),\"RUC NO EXISTE\"),\"\")","v":""}]
[null,null,{"$f":"IF(Tabla1[[#This Row],[RUC]]<>\"\", IFERROR(VLOOKUP(Tabla1[[#This Row],[RUC]], APOYO!G:H, 2, 0),\"RUC NO EXISTE\"),\"\")","v":""}]
[null,null,{"$f":"IF(Tabla1[[#This Row],[RUC]]<>\"\", IFERROR(VLOOKUP(Tabla1[[#This Row],[RUC]], APOYO!G:H, 2, 0),\"RUC NO EXISTE\"),\"\")","v":""}]
[null,null,{"$f":"IF(Tabla1[[#This Row],[RUC]]<>\"\", IFERROR(VLOOKUP(Tabla1[[#This Row],[RUC]], APOYO!G:H, 2, 0),\"RUC NO EXISTE\"),\"\")","v":""}]
[null,null,{"$f":"IF(Tabla1[[#This Row],[RUC]]<>\"\", IFERROR(VLOOKUP(Tabla1[[#This Row],[RUC]], APOYO!G:H, 2, 0),\"RUC NO EXISTE\"),\"\")","v":""}]
[null,null,{"$f":"IF(Tabla1[[#This Row],[RUC]]<>\"\", IFERROR(VLOOKUP(Tabla1[[#This Row],[RUC]], APOYO!G:H, 2, 0),\"RUC NO EXISTE\"),\"\")","v":""}]
[null,null,{"$f":"IF(Tabla1[[#This Row],[RUC]]<>\"\", IFERROR(VLOOKUP(Tabla1[[#This Row],[RUC]], APOYO!G:H, 2, 0),\"RUC NO EXISTE\"),\"\")","v":""}]
[null,null,{"$f":"IF(Tabla1[[#This Row],[RUC]]<>\"\", IFERROR(VLOOKUP(Tabla1[[#This Row],[RUC]], APOYO!G:H, 2, 0),\"RUC NO EXISTE\"),\"\")","v":""}]
[null,null,{"$f":"IF(Tabla1[[#This Row],[RUC]]<>\"\", IFERROR(VLOOKUP(Tabla1[[#This Row],[RUC]], APOYO!G:H, 2, 0),\"RUC NO EXISTE\"),\"\")","v":""}]
[null,null,{"$f":"IF(Tabla1[[#This Row],[RUC]]<>\"\", IFERROR(VLOOKUP(Tabla1[[#This Row],[RUC]], APOYO!G:H, 2, 0),\"RUC NO EXISTE\"),\"\")","v":""}]
[null,null,{"$f":"IF(Tabla1[[#This Row],[RUC]]<>\"\", IFERROR(VLOOKUP(Tabla1[[#This Row],[RUC]], APOYO!G:H, 2, 0),\"RUC NO EXISTE\"),\"\")","v":""}]
[null,null,{"$f":"IF(Tabla1[[#This Row],[RUC]]<>\"\", IFERROR(VLOOKUP(Tabla1[[#This Row],[RUC]], APOYO!G:H, 2, 0),\"RUC NO EXISTE\"),\"\")","v":""}]
[null,null,{"$f":"IF(Tabla1[[#This Row],[RUC]]<>\"\", IFERROR(VLOOKUP(Tabla1[[#This Row],[RUC]], APOYO!G:H, 2, 0),\"RUC NO EXISTE\"),\"\")","v":""}]
[null,null,{"$f":"IF(Tabla1[[#This Row],[RUC]]<>\"\", IFERROR(VLOOKUP(Tabla1[[#This Row],[RUC]], APOYO!G:H, 2, 0),\"RUC NO EXISTE\"),\"\")","v":""}]
[null,null,{"$f":"IF(Tabla1[[#This Row],[RUC]]<>\"\", IFERROR(VLOOKUP(Tabla1[[#This Row],[RUC]], APOYO!G:H, 2, 0),\"RUC NO EXISTE\"),\"\")","v":""}]
[null,null,{"$f":"IF(Tabla1[[#This Row],[RUC]]<>\"\", IFERROR(VLOOKUP(Tabla1[[#This Row],[RUC]], APOYO!G:H, 2, 0),\"RUC NO EXISTE\"),\"\")","v":""}]
[null,null,{"$f":"IF(Tabla1[[#This Row],[RUC]]<>\"\", IFERROR(VLOOKUP(Tabla1[[#This Row],[RUC]], APOYO!G:H, 2, 0),\"RUC NO EXISTE\"),\"\")","v":""}]
[null,null,{"$f":"IF(Tabla1[[#This Row],[RUC]]<>\"\", IFERROR(VLOOKUP(Tabla1[[#This Row],[RUC]], APOYO!G:H, 2, 0),\"RUC NO EXISTE\"),\"\")","v":""}]
[null,null,{"$f":"IF(Tabla1[[#This Row],[RUC]]<>\"\", IFERROR(VLOOKUP(Tabla1[[#This Row],[RUC]], APOYO!G:H, 2, 0),\"RUC NO EXISTE\"),\"\")","v":""}]
[null,null,{"$f":"IF(Tabla1[[#This Row],[RUC]]<>\"\", IFERROR(VLOOKUP(Tabla1[[#This Row],[RUC]], APOYO!G:H, 2, 0),\"RUC NO EXISTE\"),\"\")","v":""}]
[null,null,{"$f":"IF(Tabla1[[#This Row],[RUC]]<>\"\", IFERROR(VLOOKUP(Tabla1[[#This Row],[RUC]], APOYO!G:H, 2, 0),\"RUC NO EXISTE\"),\"\")","v":""}]
[null,null,{"$f":"IF(Tabla1[[#This Row],[RUC]]<>\"\", IFERROR(VLOOKUP(Tabla1[[#This Row],[RUC]], APOYO!G:H, 2, 0),\"RUC NO EXISTE\"),\"\")","v":""}]
[null,null,{"$f":"IF(Tabla1[[#This Row],[RUC]]<>\"\", IFERROR(VLOOKUP(Tabla1[[#This Row],[RUC]], APOYO!G:H, 2, 0),\"RUC NO EXISTE\"),\"\")","v":""}]
[null,null,{"$f":"IF(Tabla1[[#This Row],[RUC]]<>\"\", IFERROR(VLOOKUP(Tabla1[[#This Row],[RUC]], APOYO!G:H, 2, 0),\"RUC NO EXISTE\"),\"\")","v":""}]
[null,null,{"$f":"IF(Tabla1[[#This Row],[RUC]]<>\"\", IFERROR(VLOOKUP(Tabla1[[#This Row],[RUC]], APOYO!G:H, 2, 0),\"RUC NO EXISTE\"),\"\")","v":""}]
[null,null,{"$f":"IF(Tabla1[[#This Row],[RUC]]<>\"\", IFERROR(VLOOKUP(Tabla1[[#This Row],[RUC]], APOYO!G:H, 2, 0),\"RUC NO EXISTE\"),\"\")","v":""}]
[null,null,{"$f":"IF(Tabla1[[#This Row],[RUC]]<>\"\", IFERROR(VLOOKUP(Tabla1[[#This Row],[RUC]], APOYO!G:H, 2, 0),\"RUC NO EXISTE\"),\"\")","v":""}]

{"sheet":"APOYO","index":1,"n_rows":1026,"n_cols":8,"rows_kept":1026,"cut":false,"hidden":true,"merged":[]}
["CODIGO","CARGO",null,"CODIGO","MODALIDAD",null,"RUC","RAZÓN SOCIAL"]
["01","REPRESENTANTE LEGAL",null,"01","EN RELACIÓN DE DEPENDENCIA",null,"0190021513001","COOPERATIVA DE AHORRO Y CREDITO EDUCADORES DEL AZUAY LTDA"]
["02","PRESIDENTE DEL CONSEJO DE ADMINISTRACION",null,"02","HONORARIOS POR SERVICIOS PROFESIONALES",null,"0190021769001","COOPERATIVA DE AHORRO Y CREDITO LA MERCED LTDA"]
["03","PRIMER VOCAL PRINCIPAL DEL CONSEJO DE ADMINISTRACION",null,null,null,null,"0190024733001","COOPERATIVA DE AHORRO Y CREDITO ERCO LTDA"]
["04","SEGUNDO VOCAL PRINCIPAL DEL CONSEJO DE ADMINISTRACION",null,null,null,null,"0190075958001","COOPERATIVA DE AHORRO Y CREDITO ARTESANAL DEL AZUAY"]
["05","TERCER VOCAL PRINCIPAL DEL CONSEJO DE ADMINISTRACION",null,null,null,null,"0190087603001","COOPERATIVA DE AHORRO Y CREDITO ALFONSO JARAMILLO LEON CCC"]
["06","CUARTO VOCAL PRINCIPAL DEL CONSEJO DE ADMINISTRACION",null,null,null,null,"0190093581001","COOPERATIVA DE AHORRO Y CREDITO COOPAC AUSTRO LTDA"]
["07","QUINTO VOCAL PRINCIPAL DEL CONSEJO DE ADMINISTRACION",null,null,null,null,"0190096076001","COOPERATIVA DE AHORRO Y CREDITO SIDETAMC"]
["08","SEXTO VOCAL PRINCIPAL DEL CONSEJO DE ADMINISTRACION",null,null,null,null,"0190115798001","COOPERATIVA DE AHORRO Y CREDITO JUVENTUD ECUATORIANA PROGRESISTA LTDA"]
["09","SEPTIMO VOCAL PRINCIPAL DEL CONSEJO DE ADMINISTRACION",null,null,null,null,"0190131424001","COOPERATIVA DE AHORRO Y CREDITO ELECTRO PAUTE"]
[10,"OCTAVO VOCAL PRINCIPAL DEL CONSEJO DE ADMINISTRACION",null,null,null,null,"0190147665001","COOPERATIVA DE AHORRO Y CREDITO SERVIDORES MUNICIPALES DE CUENCA"]
[11,"NOVENO VOCAL PRINCIPAL DEL CONSEJO DE ADMINISTRACION",null,null,null,null,"0190150739001","COOPERATIVA DE AHORRO Y CREDITO ETAPA"]
[12,"PRESIDENTE DEL CONSEJO DE VIGILANCIA",null,null,null,null,"0190155722001","COOPERATIVA DE AHORRO Y CREDITO JARDIN AZUAYO LTDA"]
[13,"PRIMER VOCAL PRINCIPAL DEL CONSEJO DE VIGILANCIA",null,null,null,null,"0190158977001","COOPERATIVA DE AHORRO Y CREDITO CREA LTDA"]
[14,"SEGUNDO VOCAL PRINCIPAL DEL CONSEJO DE VIGILANCIA",null,null,null,null,"0190160262001","COOPERATIVA DE AHORRO Y CREDITO FEDERACION OBRERA"]
[15,"TERCER VOCAL PRINCIPAL DEL CONSEJO DE VIGILANCIA",null,null,null,null,"0190160378001","COOPERATIVA DE AHORRO Y CREDITO SANTA ISABEL LTDA"]
[16,"CUARTO VOCAL PRINCIPAL DEL CONSEJO DE VIGILANCIA",null,null,null,null,"0190160459001","COOPERATIVA DE AHORRO Y CREDITO MULTIEMPRESARIAL"]
[17,"QUINTO VOCAL PRINCIPAL DEL CONSEJO DE VIGILANCIA",null,null,null,null,"0190316319001","COOPERATIVA DE AHORRO Y CREDITO FASAYÑAN LTDA"]
[18,"SEXTO VOCAL PRINCIPAL DEL CONSEJO DE VIGILANCIA",null,null,null,null,"0190317196001","COOPERATIVA DE AHORRO Y CREDITO SOLIDARIOS EN LA SALUD"]
[19,"SEPTIMO VOCAL PRINCIPAL DEL CONSEJO DE VIGILANCIA",null,null,null,null,"0190317625001","COOPERATIVA DE AHORRO Y CREDITO SEÑOR DE GIRON"]
[20,"OCTAVO VOCAL PRINCIPAL DEL CONSEJO DE VIGILANCIA",null,null,null,null,"0190319296001","COOPERATIVA DE AHORRO Y CREDITO GAÑANSOL LTDA"]
[21,"CONTADOR",null,null,null,null,"0190319520001","UNION DE COOPERATIVAS DE AHORRO Y CREDITO DEL SUR UCACSUR"]
[22,"SECRETARIO",null,null,null,null,"0190322661001","COOPERATIVA DE AHORRO Y CREDITO COLEGIO DE ARQUITECTOS DEL AZUAY"]
[23,"AUDITOR EXTERNO",null,null,null,null,"0190322939001","COOPERATIVA DE AHORRO Y CREDITOFRENTE DE REIVINDICACION MAGISTERIO DEL AUSTRO"]
[24,"OFICIAL DE CUMPLIMIENTO",null,null,null,null,"0190325180001","COOPERATIVA DE AHORRO Y CREDITO SAN JOSE SJ"]
[null,null,null,null,null,null,"0190325644001","COOPERATIVA DE AHORRO Y CREDITO PROFUTURO LTDA"]
[null,null,null,null,null,null,"0190327930001","COOPERATIVA DE AHORRO Y CREDITO BAÑOS LTDA"]
[null,null,null,null,null,null,"0190327949001","COOPERATIVA DE AHORRO Y CREDITO PROMOCION DE VIDA ASOCIADA LTDA PROVIDA"]
[null,null,null,null,null,null,"0190332705001","COOPERATIVA DE AHORRO Y CREDITO DEL PERSONAL DOCENTE ADMINISTRATIVO Y DE SERVICIOS DE LA UNIDAD EDUCATIVA DE LA SALLE"]
[null,null,null,null,null,null,"0190333515001","COOPERATIVA DE AHORRO Y CREDITO COLEGIO DE INGENIEROS CIVILES DEL AZUAY CICA"]
[null,null,null,null,null,null,"0190333612001","COOPERATIVA DE AHORRO Y CREDITO AHORRISTA SOLIDARIO"]
[null,null,null,null,null,null,"0190336859001","COOPERATIVA DE AHORRO Y CREDITO UNION Y PROGRESO"]
[null,null,null,null,null,null,"0190338509001","COOPERATIVA DE AHORRO Y CREDITO JADAN"]
[null,null,null,null,null,null,"0190341097001","COOPERATIVA DE AHORRO Y CREDITO CUMBEÑITA LTDA"]
[null,null,null,null,null,null,"0190344169001","COOPERATIVA DE AHORRO Y CREDITO DEL AZUAY"]
[null,null,null,null,null,null,"0190346501001","COOPERATIVA DE AHORRO Y CREDITO CARMEN DE TARQUI"]
[null,null,null,null,null,null,"0190348075001","COOPERATIVA DE AHORRO Y CREDITO SANTA ANA"]
[null,null,null,null,null,null,"0190363163001","COOPERATIVA DE AHORRO Y CREDITO LA VOLUNTAD DE DIOS"]
[null,null,null,null,null,null,"0190363236001","COOPERATIVA DE AHORRO Y CREDITO LOS ALISOS LTDA"]
[null,null,null,null,null,null,"0190365980001","COOPERATIVA DE AHORRO Y CREDITO DEL SINDICATO DE CHOFERES PROFESIONALES DEL AZUAY LTDA"]
[null,null,null,null,null,null,"0190368424001","COOPERATIVA DE AHORRO Y CREDITO MACODES LTDA"]
[null,null,null,null,null,null,"0190370550001","COOPERATIVA DE AHORRO Y CREDITO URBADIEZ"]
[null,null,null,null,null,null,"0190371204001","COOPERATIVA DE AHORRO Y CREDITO CUENCA LTDA"]
[null,null,null,null,null,null,"0190373789001","COOPERATIVA DE AHORRO Y CREDITO COMERCIANTES MINORISTAS DEL AZUAY LTDA"]
[null,null,null,null,null,null,"0190375811001","COOPERATIVA DE AHORRO Y CREDITO CORPORACIONES UNIDAS CORPUCOOP LTDA"]
[null,null,null,null,null,null,"0190377156001","COOPERATIVA DE AHORRO Y CREDITO CHOLA CUENCANA LTDA"]
[null,null,null,null,null,null,"0190377733001","COOPERATIVA DE AHORRO Y CREDITO ÑUKANCHIK LLUGZHINA LTDA"]
[null,null,null,null,null,null,"0190380149001","COOPERATIVA DE AHORRO Y CREDITO FUTURO PROGRESISTA LTDA COOACFP"]
[null,null,null,null,null,null,"0190419401001","COOPERATIVA DE AHORRO Y CREDITO MAS AHORRO SOLIDARIO \"MASCOOP\""]
[null,null,null,null,null,null,"0290001269001","COOPERATIVA DE AHORRO Y CREDITO GUARANDA LTDA"]
[null,null,null,null,null,null,"0290001684001","COOPERATIVA DE AHORRO Y CREDITO EDUCADORES DE BOLIVAR"]
[null,null,null,null,null,null,"0290003180001","COOPERATIVA DE AHORRO Y CREDITO SAN MIGUEL LTDA"]
[null,null,null,null,null,null,"0290003288001","COOPERATIVA DE AHORRO Y CREDITO SAN JOSE LTDA"]
[null,null,null,null,null,null,"0290004454001","COOPERATIVA DE AHORRO Y CREDITO JUAN PIO DE MORA LTDA"]
[null,null,null,null,null,null,"0290030099001","COOPERATIVA DE AHORRO Y CREDITO SAN PEDRO LTDA"]
[null,null,null,null,null,null,"0290034337001","COOPERATIVA DE AHORRO Y CREDITO SALINAS LIMITADA"]
[null,null,null,null,null,null,"0290035260001","COOPERATIVA DE AHORRO Y CREDITO LAS NAVES LTDA"]
[null,null,null,null,null,null,"0291500358001","COOPERATIVA DE AHORRO Y CREDITO SAN MIGUEL DE MONOLOMA LTDA"]
[null,null,null,null,null,null,"0291500994001","COOPERATIVA DE AHORRO Y CREDITO SIMIATUG LIMITADA"]
[null,null,null,null,null,null,"0291502474001","COOPERATIVA DE AHORRO Y CREDITO DEL ARTESANO DE LA ASOCIACION DE ARTESANOS DE CALUMA"]
[null,null,null,null,null,null,"0291505279001","COOPERATIVA DE AHORRO Y CREDITO KULLKY MINKANA WASI LTDA"]
[null,null,null,null,null,null,"0291505783001","COOPERATIVA DE AHORRO Y CREDITO INTIÑAN LTDA"]
[null,null,null,null,null,null,"0291506445001","COOPERATIVA DE AHORRO Y CREDITO CURI WASI LTDA"]
[null,null,null,null,null,null,"0291506933001","COOPERATIVA DE AHORRO Y CREDITO CAMINO DE LUZ LTDA"]
[null,null,null,null,null,null,"0291509347001","COOPERATIVA DE AHORRO Y CREDITO MUSHUK KURI ÑAN LTDA"]
[null,null,null,null,null,null,"0291509630001","COOPERATIVA DE AHORRO Y CREDITO LOS CHASQUIS LTDA"]
[null,null,null,null,null,null,"0291510973001","COOPERATIVA DE AHORRO Y CREDITO WIÑARIK KAWSAY"]
[null,null,null,null,null,null,"0291511066001","COOPERATIVA DE AHORRO Y CREDITO SURUPUKYU LTDA"]
[null,null,null,null,null,null,"0291511112001","COOPERATIVA DE AHORRO Y CREDITO JOYOCOTO LTDA"]
[null,null,null,null,null,null,"0291511279001","COOPERATIVA DE AHORRO Y CREDITO CASIPAMBA LTDA"]
[null,null,null,null,null,null,"0291511880001","COOPERATIVA DE AHORRO Y CREDITO UNIDAD Y TRABAJO TANTALLA LLANKASHUN"]
[null,null,null,null,null,null,"0390000804001","COOPERATIVA DE AHORRO Y CREDITO CAÑAR LTDA"]
[null,null,null,null,null,null,"0390027923001","COOPERATIVA DE AHORRO Y CREDITO DE LA PEQUEÑA EMPRESA BIBLIAN LTDA"]
[null,null,null,null,null,null,"0391000115001","COOPERATIVA DE AHORRO Y CREDITO DE LOS EMPLEADOS Y TRABAJADORES DE LA ILUSTRE MUNICIPALIDAD DE AZOGUES CACMA LTDA"]
[null,null,null,null,null,null,"0391001545001","COOPERATIVA DE AHORRO Y CREDITO GUAPAN LTDA"]
[null,null,null,null,null,null,"0391001588001","COOPERATIVA DE AHORRO Y CREDITO CACIQUE GURITAVE"]
[null,null,null,null,null,null,"0391001596001","COOPERATIVA DE AHORRO Y CREDITO SOLIDARIDAD Y PROGRESO ORIENTAL"]
[null,null,null,null,null,null,"0391005664001","COOPERATIVA DE AHORRO Y CREDITO MUSHUK-YUYAY"]
[null,null,null,null,null,null,"0391008019001","COOPERATIVA DE AHORRO Y CREDITO WIÑARIY INTERCULTURAL PARA EL FOMENTO"]
[null,null,null,null,null,null,"0391008558001","COOPERATIVA DE AHORRO Y CREDITO SAN MARCOS"]
[null,null,null,null,null,null,"0391010110001","COOPERATIVA DE AHORRO Y CREDITO ALLI PUSHAK"]
[null,null,null,null,null,null,"0391011370001","COOPERATIVA DE AHORRO Y CREDITO EL MIGRANTE SOLIDARIO"]
[null,null,null,null,null,null,"0391012431001","COOPERATIVA DE AHORRO Y CREDITO LOS KAÑARIS"]
[null,null,null,null,null,null,"0391012849001","COOPERATIVA DE AHORRO Y CREDITO SISAY KAÑARI"]
[null,null,null,null,null,null,"0391012911001","COOPERATIVA DE AHORRO Y CREDITO ACHIK INTI LTDA"]
[null,null,null,null,null,null,"0391013152001","COOPERATIVA DE AHORRO Y CREDITO ECUACHASKI"]
[null,null,null,null,null,null,"0391013217001","CORPORACION PARA EL DESARROLLO SOCIAL Y FINANCIERA FUERZA DE LOS ANDES"]
[null,null,null,null,null,null,"0391013241001","COOPERATIVA DE AHORRO Y CREDITO DEL MIGRANTE LTDA"]
[null,null,null,null,null,null,"0391013756001","COOPERATIVA DE AHORRO Y CREDITO SINCHI CODEFIS"]
[null,null,null,null,null,null,"0391015678001","COOPERATIVA DE AHORRO Y CREDITO ATLANTIDA"]
[null,null,null,null,null,null,"0490001883001","COOPERATIVA DE AHORRO Y CREDITO PABLO MUÑOZ VEGA LTDA"]
[null,null,null,null,null,null,"0490002669001","COOPERATIVA DE AHORRO Y CREDITO TULCAN LTDA"]
[null,null,null,null,null,null,"0490007458001","COOPERATIVA DE AHORRO Y CREDITO EDUCADORES TULCAN LTDA"]
[null,null,null,null,null,null,"0490009078001","COOPERATIVA DE AHORRO Y CREDITO LA PAZ LTDA"]
[null,null,null,null,null,null,"0490009124001","COOPERATIVA DE AHORRO Y CREDITO SAN GABRIEL LTDA"]
[null,null,null,null,null,null,"0491507012001","COOPERATIVA DE AHORRO Y CREDITO 5 DE MAYO DE SANTA MARTHA DE CUBA"]
[null,null,null,null,null,null,"0491508094001","COOPERATIVA DE AHORRO Y CREDITO 10 DE SEPTIEMBRE"]
[null,null,null,null,null,null,"0491508973001","COOPERATIVA DE AHORRO Y CREDITO PADRE VICENTE PONCE RUBIO"]
[null,null,null,null,null,null,"0590024937001","COOPERATIVA DE AHORRO Y CREDITO EDUCADORES PRIMARIOS DEL COTOPAXI"]
[null,null,null,null,null,null,"0590041920001","COOPERATIVA DE AHORRO Y CREDITO 9 DE OCTUBRE LTDA"]
[null,null,null,null,null,null,"0590052000001","COOPERATIVA DE AHORRO Y CREDITO DE LA PEQUEÑA EMPRESA DE COTOPAXI LTDA"]
[null,null,null,null,null,null,"0590060437001","COOPERATIVA DE AHORRO Y CREDITO SAN MIGUEL DE SIGCHOS"]
[null,null,null,null,null,null,"0590060461001","COOPERATIVA DE AHORRO Y CREDITO UNION MERCEDARIA LTDA"]
[null,null,null,null,null,null,"0590061123001","COOPERATIVA DE AHORRO Y CREDITO FUTURO LAMANENSE"]
[null,null,null,null,null,null,"0590061379001","COOPERATIVA DE AHORRO Y CREDITO MONSEÑOR LEONIDAS PROAÑO"]
[null,null,null,null,null,null,"0591700014001","COOPERATIVA DE AHORRO Y CREDITO EMPLEADOS MUNICIPALES DE LATACUNGA LTDA"]
[null,null,null,null,null,null,"0591700030001","COOPERATIVA DE AHORRO Y CREDITO CAMARA DE COMERCIO LATACUNGA LTDA"]
[null,null,null,null,null,null,"0591700340001","COOPERATIVA DE AHORRO Y CREDITO CAMARA DE COMERCIO DE LA MANA"]
[null,null,null,null,null,null,"0591700847001","COOPERATIVA DE AHORRO Y CREDITO IESS COTOPAXI LTDA"]
[null,null,null,null,null,null,"0591702262001","COOPERATIVA DE AHORRO Y CREDITO SAN ANTONIO DE LASSO"]
[null,null,null,null,null,null,"0591703897001","COOPERATIVA DE AHORRO Y CREDITO FRAY MANUEL SALCEDO LTDA"]
[null,null,null,null,null,null,"0591705628001","COOPERATIVA DE AHORRO Y CREDITO NUEVA ESPERANZA LTDA"]
[null,null,null,null,null,null,"0591709070001","COOPERATIVA DE AHORRO Y CREDITO DIRECCION PROVINCIAL DE SALUD DE COTOPAXI"]
[null,null,null,null,null,null,"0591709917001","COOPERATIVA DE AHORRO Y CREDITO EXITO LTDA"]
[null,null,null,null,null,null,"0591711164001","COOPERATIVA DE AHORRO Y CREDITO VIRGEN DEL CISNE"]
[null,null,null,null,null,null,"0591711563001","COOPERATIVA DE AHORRO Y CREDITO SUMAK KAWSAY LTDA"]
[null,null,null,null,null,null,"0591712349001","COOPERATIVA DE AHORRO Y CREDITO AYLLO KUNAPAK LLANKAY LTDA"]
[null,null,null,null,null,null,"0591712470001","COOPERATIVA DE AHORRO Y CREDITO PILAHUIN"]
[null,null,null,null,null,null,"0591712942001","COOPERATIVA DE AHORRO Y CREDITO RUNA SHUNGO"]
[null,null,null,null,null,null,"0591713094001","COOPERATIVA DE AHORRO Y CREDITO ANDINA LTDA"]
{"$rows_left_out":906}