{"text_format":"1","workbook":"xlsx","n_sheets":3,"sheets":["SF BÁSICOS Y MÁXIMOS","Hoja1","LISTA 2"],"not_rendered":{"charts":0,"images":1,"macros":1,"external_links":0,"defined_names":48,"comments":0,"pivot_tables":0},"unopened":[],"bounds":{"document_bytes":16777216,"sheet_cells":100000,"rows_first":2000,"rows_last":500,"rows_between":2000,"halvings":0,"cell_chars":16384,"cell_head_chars":4096},"cells_cut":0,"cells_raw":0,"read":"whole","date_system":"1900"}

{"sheet":"SF BÁSICOS Y MÁXIMOS","index":0,"n_rows":364,"n_cols":12,"rows_kept":364,"cut":false,"hidden":false,"merged":[[12,11,13,11],[12,5,12,7],[12,1,13,1],[12,8,12,9],[12,10,13,10],[12,3,13,3],[12,4,13,4],[12,2,13,2]]}
[]
[]
[]
[]
[]
[]
[]
[]
[null,"RUC:"]
[null,"RAZÓN SOCIAL:"]
[null,"FECHA DE CORTE:"]
[]
[null,"No.","NOMBRE COMERCIAL DEL SERVICIO","SERVICIO","TIPO DE SERVICIO","AUTORIZACIÓN ANTES DE LA NORMA VIGENTE",null,null,"CARGO UNITARIO",null,"NÚMERO  DE TRANSACCIONES \n(Anual)","REGISTRO CONTABLE\n(CÓDIGO DE CUENTA)"]
[null,null,null,null,null,"ORGANISMO DE CONTROL","FECHA","NÚMERO","VALOR SIN IVA","PORCENTUAL"]
[null,{"$f":"+B14+1","v":1},null,null,{"$f":"IFERROR(VLOOKUP(D15,Hoja1!$A$3:$C$144,3,FALSE),\" \")","v":" "}]
[null,{"$f":"+B15+1","v":2},null,null,{"$f":"IFERROR(VLOOKUP(D16,Hoja1!$A$3:$C$144,3,FALSE),\" \")","v":" "}]
[null,3,null,null,{"$f":"IFERROR(VLOOKUP(D17,Hoja1!$A$3:$C$144,3,FALSE),\" \")","v":" "}]
[null,4,null,null,{"$f":"IFERROR(VLOOKUP(D18,Hoja1!$A$3:$C$144,3,FALSE),\" \")","v":" "}]
[null,5,null,null,{"$f":"IFERROR(VLOOKUP(D19,Hoja1!$A$3:$C$144,3,FALSE),\" \")","v":" "}]
[null,6,null,null,{"$f":"IFERROR(VLOOKUP(D20,Hoja1!$A$3:$C$144,3,FALSE),\" \")","v":" "}]
[null,7,null,null,{"$f":"IFERROR(VLOOKUP(D21,Hoja1!$A$3:$C$144,3,FALSE),\" \")","v":" "}]
[null,8,null,null,{"$f":"IFERROR(VLOOKUP(D22,Hoja1!$A$3:$C$144,3,FALSE),\" \")","v":" "}]
[null,9,null,null,{"$f":"IFERROR(VLOOKUP(D23,Hoja1!$A$3:$C$144,3,FALSE),\" \")","v":" "}]
[null,10,null,null,{"$f":"IFERROR(VLOOKUP(D24,Hoja1!$A$3:$C$144,3,FALSE),\" \")","v":" "}]
[null,11,null,null,{"$f":"IFERROR(VLOOKUP(D25,Hoja1!$A$3:$C$144,3,FALSE),\" \")","v":" "}]
[null,12,null,null,{"$f":"IFERROR(VLOOKUP(D26,Hoja1!$A$3:$C$144,3,FALSE),\" \")","v":" "}]
[null,13,null,null,{"$f":"IFERROR(VLOOKUP(D27,Hoja1!$A$3:$C$144,3,FALSE),\" \")","v":" "}]
[null,14,null,null,{"$f":"IFERROR(VLOOKUP(D28,Hoja1!$A$3:$C$144,3,FALSE),\" \")","v":" "}]
[null,15,null,null,{"$f":"IFERROR(VLOOKUP(D29,Hoja1!$A$3:$C$144,3,FALSE),\" \")","v":" "}]
[null,16,null,null,{"$f":"IFERROR(VLOOKUP(D30,Hoja1!$A$3:$C$144,3,FALSE),\" \")","v":" "}]
[null,17,null,null,{"$f":"IFERROR(VLOOKUP(D31,Hoja1!$A$3:$C$144,3,FALSE),\" \")","v":" "}]
[null,18,null,null,{"$f":"IFERROR(VLOOKUP(D32,Hoja1!$A$3:$C$144,3,FALSE),\" \")","v":" "}]
[null,19,null,null,{"$f":"IFERROR(VLOOKUP(D33,Hoja1!$A$3:$C$144,3,FALSE),\" \")","v":" "}]
[null,20,null,null,{"$f":"IFERROR(VLOOKUP(D34,Hoja1!$A$3:$C$144,3,FALSE),\" \")","v":" "}]
[null,21,null,null,{"$f":"IFERROR(VLOOKUP(D35,Hoja1!$A$3:$C$144,3,FALSE),\" \")","v":" "}]
[null,22,null,null,{"$f":"IFERROR(VLOOKUP(D36,Hoja1!$A$3:$C$144,3,FALSE),\" \")","v":" "}]
[null,23,null,null,{"$f":"IFERROR(VLOOKUP(D37,Hoja1!$A$3:$C$144,3,FALSE),\" \")","v":" "}]
[null,24,null,null,{"$f":"IFERROR(VLOOKUP(D38,Hoja1!$A$3:$C$144,3,FALSE),\" \")","v":" "}]
[null,25,null,null,{"$f":"IFERROR(VLOOKUP(D39,Hoja1!$A$3:$C$144,3,FALSE),\" \")","v":" "}]
[null,26,null,null,{"$f":"IFERROR(VLOOKUP(D40,Hoja1!$A$3:$C$144,3,FALSE),\" \")","v":" "}]
[null,27,null,null,{"$f":"IFERROR(VLOOKUP(D41,Hoja1!$A$3:$C$144,3,FALSE),\" \")","v":" "}]
[null,28,null,null,{"$f":"IFERROR(VLOOKUP(D42,Hoja1!$A$3:$C$144,3,FALSE),\" \")","v":" "}]
[null,29,null,null,{"$f":"IFERROR(VLOOKUP(D43,Hoja1!$A$3:$C$144,3,FALSE),\" \")","v":" "}]
[null,30,null,null,{"$f":"IFERROR(VLOOKUP(D44,Hoja1!$A$3:$C$144,3,FALSE),\" \")","v":" "}]
[null,31,null,null,{"$f":"IFERROR(VLOOKUP(D45,Hoja1!$A$3:$C$144,3,FALSE),\" \")","v":" "}]
[null,32,null,null,{"$f":"IFERROR(VLOOKUP(D46,Hoja1!$A$3:$C$144,3,FALSE),\" \")","v":" "}]
[null,33,null,null,{"$f":"IFERROR(VLOOKUP(D47,Hoja1!$A$3:$C$144,3,FALSE),\" \")","v":" "}]
[null,34,null,null,{"$f":"IFERROR(VLOOKUP(D48,Hoja1!$A$3:$C$144,3,FALSE),\" \")","v":" "}]
[null,35,null,null,{"$f":"IFERROR(VLOOKUP(D49,Hoja1!$A$3:$C$144,3,FALSE),\" \")","v":" "}]
[null,36,null,null,{"$f":"IFERROR(VLOOKUP(D50,Hoja1!$A$3:$C$144,3,FALSE),\" \")","v":" "}]
[null,37,null,null,{"$f":"IFERROR(VLOOKUP(D51,Hoja1!$A$3:$C$144,3,FALSE),\" \")","v":" "}]
[null,38,null,null,{"$f":"IFERROR(VLOOKUP(D52,Hoja1!$A$3:$C$144,3,FALSE),\" \")","v":" "}]
[null,39,null,null,{"$f":"IFERROR(VLOOKUP(D53,Hoja1!$A$3:$C$144,3,FALSE),\" \")","v":" "}]
[null,40,null,null,{"$f":"IFERROR(VLOOKUP(D54,Hoja1!$A$3:$C$144,3,FALSE),\" \")","v":" "}]
[null,41,null,null,{"$f":"IFERROR(VLOOKUP(D55,Hoja1!$A$3:$C$144,3,FALSE),\" \")","v":" "}]
[null,42,null,null,{"$f":"IFERROR(VLOOKUP(D56,Hoja1!$A$3:$C$144,3,FALSE),\" \")","v":" "}]
[null,43,null,null,{"$f":"IFERROR(VLOOKUP(D57,Hoja1!$A$3:$C$144,3,FALSE),\" \")","v":" "}]
[null,44,null,null,{"$f":"IFERROR(VLOOKUP(D58,Hoja1!$A$3:$C$144,3,FALSE),\" \")","v":" "}]
[null,45,null,null,{"$f":"IFERROR(VLOOKUP(D59,Hoja1!$A$3:$C$144,3,FALSE),\" \")","v":" "}]
[null,46,null,null,{"$f":"IFERROR(VLOOKUP(D60,Hoja1!$A$3:$C$144,3,FALSE),\" \")","v":" "}]
[null,47,null,null,{"$f":"IFERROR(VLOOKUP(D61,Hoja1!$A$3:$C$144,3,FALSE),\" \")","v":" "}]
[null,48,null,null,{"$f":"IFERROR(VLOOKUP(D62,Hoja1!$A$3:$C$144,3,FALSE),\" \")","v":" "}]
[null,49,null,null,{"$f":"IFERROR(VLOOKUP(D63,Hoja1!$A$3:$C$144,3,FALSE),\" \")","v":" "}]
[null,50,null,null,{"$f":"IFERROR(VLOOKUP(D64,Hoja1!$A$3:$C$144,3,FALSE),\" \")","v":" "}]
[null,51,null,null,{"$f":"IFERROR(VLOOKUP(D65,Hoja1!$A$3:$C$144,3,FALSE),\" \")","v":" "}]
[null,52,null,null,{"$f":"IFERROR(VLOOKUP(D66,Hoja1!$A$3:$C$144,3,FALSE),\" \")","v":" "}]
[null,53,null,null,{"$f":"IFERROR(VLOOKUP(D67,Hoja1!$A$3:$C$144,3,FALSE),\" \")","v":" "}]
[null,54,null,null,{"$f":"IFERROR(VLOOKUP(D68,Hoja1!$A$3:$C$144,3,FALSE),\" \")","v":" "}]
[null,55,null,null,{"$f":"IFERROR(VLOOKUP(D69,Hoja1!$A$3:$C$144,3,FALSE),\" \")","v":" "}]
[null,56,null,null,{"$f":"IFERROR(VLOOKUP(D70,Hoja1!$A$3:$C$144,3,FALSE),\" \")","v":" "}]
[null,57,null,null,{"$f":"IFERROR(VLOOKUP(D71,Hoja1!$A$3:$C$144,3,FALSE),\" \")","v":" "}]
[null,58,null,null,{"$f":"IFERROR(VLOOKUP(D72,Hoja1!$A$3:$C$144,3,FALSE),\" \")","v":" "}]
[null,59,null,null,{"$f":"IFERROR(VLOOKUP(D73,Hoja1!$A$3:$C$144,3,FALSE),\" \")","v":" "}]
[null,60,null,null,{"$f":"IFERROR(VLOOKUP(D74,Hoja1!$A$3:$C$144,3,FALSE),\" \")","v":" "}]
[null,61,null,null,{"$f":"IFERROR(VLOOKUP(D75,Hoja1!$A$3:$C$144,3,FALSE),\" \")","v":" "}]
[null,62,null,null,{"$f":"IFERROR(VLOOKUP(D76,Hoja1!$A$3:$C$144,3,FALSE),\" \")","v":" "}]
[null,63,null,null,{"$f":"IFERROR(VLOOKUP(D77,Hoja1!$A$3:$C$144,3,FALSE),\" \")","v":" "}]
[null,64,null,null,{"$f":"IFERROR(VLOOKUP(D78,Hoja1!$A$3:$C$144,3,FALSE),\" \")","v":" "}]
[null,65,null,null,{"$f":"IFERROR(VLOOKUP(D79,Hoja1!$A$3:$C$144,3,FALSE),\" \")","v":" "}]
[null,66,null,null,{"$f":"IFERROR(VLOOKUP(D80,Hoja1!$A$3:$C$144,3,FALSE),\" \")","v":" "}]
{"$rows_left_out":285}
{"sheet":"Hoja1","index":1,"n_rows":144,"n_cols":5,"rows_kept":144,"cut":false,"hidden":true,"merged":[]}
[]
["Nombre del Servicio","GENÉRICO","TIPO","Cargo* (Dólares)","Segmento"]
["Activación de cuenta de ahorros","Activación de cuentas","BÁSICOS",0,"Todos"]
["Activación de tarjeta de crédito nacional o internacional","Activación de cuentas","BÁSICOS",0,1]
["Activación de tarjeta de débito y/o pago nacional o internacional","Activación de cuentas","BÁSICOS",0,"Todos"]
["Administración, mantenimiento, mantención y manejo de cuentas cuenta de ahorros","Administración, mantenimiento, mantención y manejo de cuentas","BÁSICOS",0,"Todos"]
["Administración, mantenimiento, mantención y manejo de cuentas depósitos a plazos","Administración, mantenimiento, mantención y manejo de cuentas","BÁSICOS",0,"Todos"]
["Administración, mantenimiento, mantención y manejo de cuentas inversiones","Administración, mantenimiento, mantención y manejo de cuentas","BÁSICOS",0,"Todos"]
["Afiliación y renovación de tarjetas de crédito empresarial","Afiliación y renovación de tarjetas de crédito","BÁSICOS",0,1]
["Afiliación y renovación de tarjetas de crédito marca compartida","Afiliación y renovación de tarjetas de crédito","BÁSICOS",0,1]
["Afiliación y renovación de tarjetas de crédito persona natural","Afiliación y renovación de tarjetas de crédito","BÁSICOS",0,1]
["Afiliación y renovación de tarjetas de crédito sistema cerrado","Afiliación y renovación de tarjetas de crédito","BÁSICOS",0,1]
["Afiliación y renovación de tarjetas de crédito tarjeta básica","Afiliación y renovación de tarjetas de crédito","BÁSICOS",0,1]
["Apertura de cuenta de integración de capital","Apertura de cuentas","BÁSICOS",0,"Todos"]
["Apertura de cuentas de ahorros ","Apertura de cuentas","BÁSICOS",0,"Todos"]
["Apertura de cuentas inversiones","Apertura de cuentas","BÁSICOS",0,"Todos"]
["Apertura de depósitos a plazo","Apertura de cuentas","BÁSICOS",0,"Todos"]
["Bloqueo, anulación o cancelación de tarjeta crédito","Bloqueo, anulación o cancelación","BÁSICOS",0,1]
["Bloqueo, anulación o cancelación de tarjeta de débito y/o pago","Bloqueo, anulación o cancelación","BÁSICOS",0,"Todos"]
["Cancelación o cierre de cuentas  de ahorros","Cancelación o cierre de cuentas","BÁSICOS",0,"Todos"]
["Cargos a establecimientos comerciales (educación) por consumos con tarjetas de crédito corriente/rotativo (%)","Servicios a establecimientos por consumo pagados con tarjetas","MÁXIMOS",4.02E-2,1]
["Cargos a establecimientos comerciales (salud y afines) por consumos con tarjetas de crédito corriente/rotativo (%)","Servicios a establecimientos por consumo pagados con tarjetas","MÁXIMOS",4.02E-2,1]
["Cargos a establecimientos comerciales por consumos con tarjetas de crédito corriente/rotativo (%)","Servicios a establecimientos por consumo pagados con tarjetas","MÁXIMOS",4.02E-2,1]
["Cargos a establecimientos comerciales por consumos con tarjetas de débito/prepago (%)","Servicios a establecimientos por consumo pagados con tarjetas","MÁXIMOS",0.02,"Todos"]
["Cheque de emergencia","Servicios con cheques","MÁXIMOS",2.23,"Todos"]
["Cheque devuelto del exterior","Servicios con cheques","MÁXIMOS",2.89,"Todos"]
["Cheque devuelto nacional (1)","Servicios con cheques","MÁXIMOS",2.4900000000000002,"Todos"]
["Cobranza extrajudicial rango de cuota de $ 100 a 199  (de 1 a 30 días)","Gestión de cobranza extrajudicial ","MÁXIMOS",7.35,"Todos"]
["Cobranza extrajudicial rango de cuota de $ 100 a 199  (de 31 a 60 días)","Gestión de cobranza extrajudicial ","MÁXIMOS",16.46,"Todos"]
["Cobranza extrajudicial rango de cuota de $ 100 a 199  (de 61 a 90 días)","Gestión de cobranza extrajudicial ","MÁXIMOS",23.85,"Todos"]
["Cobranza extrajudicial rango de cuota de $ 100 a 199  (más de 90 días)","Gestión de cobranza extrajudicial ","MÁXIMOS",26.64,"Todos"]
["Cobranza extrajudicial rango de cuota de $ 200 a 299  (de 1 a 30 días)","Gestión de cobranza extrajudicial ","MÁXIMOS",7.92,"Todos"]
["Cobranza extrajudicial rango de cuota de $ 200 a 299  (de 31 a 60 días)","Gestión de cobranza extrajudicial ","MÁXIMOS",17.829999999999998,"Todos"]
["Cobranza extrajudicial rango de cuota de $ 200 a 299  (de 61 a 90 días)","Gestión de cobranza extrajudicial ","MÁXIMOS",25.27,"Todos"]
["Cobranza extrajudicial rango de cuota de $ 200 a 299  (más de 90 días)","Gestión de cobranza extrajudicial ","MÁXIMOS",29.03,"Todos"]
["Cobranza extrajudicial rango de cuota de $ 300 a 499  (de 1 a 30 días)","Gestión de cobranza extrajudicial ","MÁXIMOS",8.32,"Todos"]
["Cobranza extrajudicial rango de cuota de $ 300 a 499  (de 31 a 60 días)","Gestión de cobranza extrajudicial ","MÁXIMOS",20.34,"Todos"]
["Cobranza extrajudicial rango de cuota de $ 300 a 499  (de 61 a 90 días)","Gestión de cobranza extrajudicial ","MÁXIMOS",27.43,"Todos"]
["Cobranza extrajudicial rango de cuota de $ 300 a 499  (más de 90 días)","Gestión de cobranza extrajudicial ","MÁXIMOS",32.72,"Todos"]
["Cobranza extrajudicial rango de cuota de $ 500 a 999  (de 1 a 30 días)","Gestión de cobranza extrajudicial ","MÁXIMOS",8.6300000000000008,"Todos"]
["Cobranza extrajudicial rango de cuota de $ 500 a 999  (de 31 a 60 días)","Gestión de cobranza extrajudicial ","MÁXIMOS",23.99,"Todos"]
["Cobranza extrajudicial rango de cuota de $ 500 a 999  (de 61 a 90 días)","Gestión de cobranza extrajudicial ","MÁXIMOS",30.34,"Todos"]
["Cobranza extrajudicial rango de cuota de $ 500 a 999  (más de 90 días)","Gestión de cobranza extrajudicial ","MÁXIMOS",37.700000000000003,"Todos"]
["Cobranza extrajudicial rango de cuota mayor a $ 1.000  (de 1 a 30 días)","Gestión de cobranza extrajudicial ","MÁXIMOS",8.8800000000000008,"Todos"]
["Cobranza extrajudicial rango de cuota mayor a $ 1.000  (de 31 a 60 días)","Gestión de cobranza extrajudicial ","MÁXIMOS",28.78,"Todos"]
["Cobranza extrajudicial rango de cuota mayor a $ 1.000  (de 61 a 90 días)","Gestión de cobranza extrajudicial ","MÁXIMOS",34.01,"Todos"]
["Cobranza extrajudicial rango de cuota mayor a $ 1.000  (más de 90 días)","Gestión de cobranza extrajudicial ","MÁXIMOS",43.99,"Todos"]
["Cobranza extrajudicial rango de cuota menor a $ 100  (de 1 a 30 días)","Gestión de cobranza extrajudicial ","MÁXIMOS",6.38,"Todos"]
["Cobranza extrajudicial rango de cuota menor a $ 100 (de 31 a 60 días)","Gestión de cobranza extrajudicial ","MÁXIMOS",16.23,"Todos"]
["Cobranza extrajudicial rango de cuota menor a $ 100 (de 61 a 90 días)","Gestión de cobranza extrajudicial ","MÁXIMOS",23.17,"Todos"]
["Cobranza extrajudicial rango de cuota menor a $ 100 (más de 90 días)","Gestión de cobranza extrajudicial ","MÁXIMOS",25.56,"Todos"]
["Confirmaciones financieras para auditores externos","Servicios de referencias","MÁXIMOS",2.37,"Todos"]
["Consulta de cuentas, canal celular","Consulta de cuentas","BÁSICOS",0,"Todos"]
["Consulta de cuentas, canal telefónico","Consulta de cuentas","BÁSICOS",0,"Todos"]
["Consulta de cuentas, internet","Consulta de cuentas","BÁSICOS",0,"Todos"]
["Consulta de cuentas, oficina","Consulta de cuentas","BÁSICOS",0,"Todos"]
["Consulta impresa de saldos por cajero automático","Servicios de consulta","MÁXIMOS",0.31,"Todos"]
["Consulta visual de cuentas, cajero automático","Consulta de cuentas","BÁSICOS",0,"Todos"]
["Consultas en el exterior en cajeros automáticos (2)","Servicios de consultas con tarjetas en el exterior","MÁXIMOS",0.89,"Todos"]
["Consumo en gasolineras con tarjeta de crédito, débito y prepago","Servicios de consumos nacionales ","MÁXIMOS",0.23,"Todos"]
["Consumos en el exterior con tarjetas por montos mayores a $100 (3)","Servicios de consumos con tarjetas en el exterior","MÁXIMOS",1.7,"Todos"]
["Copia de estado de cuenta de tarjeta de crédito","Servicios de copias","MÁXIMOS",0.45,1]
["Copia de voucher/vale del exterior, aplica a tarjeta de crédito","Servicios de copias","MÁXIMOS",8.93,1]
["Copia de voucher/vale local aplica a tarjeta de crédito","Servicios de copias","MÁXIMOS",1.79,1]
["Corte de movimientos de cuenta de cualquier  tipo de cuenta y por cualquier medio, a excepción de entrega en oficina en la entidad","Consulta de cuentas","BÁSICOS",0,"Todos"]
["Corte impreso de movimientos de cuentas para cualquier tipo de cuentas y entregado en oficinas de la entidad por solicitud expresa del socio/cliente (4)","Servicios de referencias","MÁXIMOS",1.63,"Todos"]
["Depósitos  cuentas de ahorros","Depósitos a cuentas","BÁSICOS",0,"Todos"]
["Depósitos  inversiones","Depósitos a cuentas","BÁSICOS",0,"Todos"]
["Depósitos a plazos","Depósitos a cuentas","BÁSICOS",0,"Todos"]
["Depósitos o retiros a través de las ventanillas compartidas de otras instituciones financieras o corresponsales solidarios","Servicios de ventanilla compartida ","MÁXIMOS",0.35,"Todos"]
["Descarga de tarjeta prepago en corresponsal solidario (8)","Servicios para tarjetas prepago","MÁXIMOS",0.31,"Todos"]
["Emisión de plástico de tarjeta de crédito con chip (5)","Servicios de emisión","MÁXIMOS",5.36,1]
["Emisión de plástico de tarjeta de débito con chip (5)","Servicios de emisión","MÁXIMOS",5.36,"Todos"]
["Emisión de plástico de tarjeta de débito/crédito con banda lectora","Servicios de emisión","BÁSICOS",0,"Todos"]
["Emisión de referencias financieras","Servicios de referencias","MÁXIMOS",4.46,"Todos"]
["Emisión de tabla de amortización, primera impresión","Emisión de tabla de amortización","BÁSICOS",0,"Todos"]
["Emisión de tarjeta prepago recargable con chip (incluye la primera carga) (7)","Servicios para tarjetas prepago","MÁXIMOS",5.36,"Todos"]
["Emisión y entrega de estados de cuenta a domicilio (tarjetas de crédito)","Servicios con estados de cuenta","MÁXIMOS",1.66,1]
["Emisión y entrega de estados de cuenta de todo tipo de cuenta por medios electrónicos y emisión y entrega física para todas las cuentas (a excepción de tarjeta de crédito) ","Emisión y entrega de estado de cuenta","BÁSICOS",0,"Todos"]
["Frecuencia de transacciones cuenta de ahorros","Frecuencia de transacciones","BÁSICOS",0,"Todos"]
{"$rows_left_out":65}
{"sheet":"LISTA 2","index":2,"n_rows":29,"n_cols":7,"rows_kept":29,"cut":false,"hidden":true,"merged":[]}
[]
[]
["TIPO DE SERVICIOS",null,"TIPO DE SERVICIOS",null,"QUIEN PAGA EL CARGO DEL SERVICIO",null,"QUIEN PRESTA EL SERVICIO"]
["Transacciones básicas",null,"Básicos",null,"Empresa privada",null,"Entidades (cooperativa/caja central)"]
["Tarifa máxima",null,"Máximos",null,"Empresa pública"]
["Tarifa diferenciado",null,"Diferenciados",null,"Socio/cliente"]
["No financieros"]
[]
["ADJUNTO"]
["No aplica"]
["Adjunto",null,null,null,"QUIEN CONTRATA EL SERVICIO"]
[null,null,null,null,"Empresa privada"]
[null,null,null,null,"Empresa pública"]
[null,null,"BENEFICIARIO",null,"Socio/cliente"]
[null,null,"Socio",null,"No aplica"]
[null,null,"Cliente"]
["ORGANISMO DE CONTROL",null,"Usuario",null,"CANALES"]
["SEPS",null,"Empresa privada",null,"Banca celular"]
["SBS",null,"Empresa pública",null,"Banca telefónica"]
["MIES",null,"Establecimientos",null,"Cajeros automáticos"]
[null,null,null,null,"Corresponsal solidario"]
[null,null,null,null,"Entidades de servicios auxiliares del sistema financiero"]
["√",null,null,null,"Internet"]
["-",null,null,null,"Oficina (ventanillas de la entidad)"]
[null,null,null,null,"Tarjeta de crédito POS"]
[null,null,null,null,"Tarjeta de débito POS"]
[null,null,null,null,"Tarjeta prepago POS"]
[null,null,null,null,"Terminal de autoservicios kiosko"]
[null,null,null,null,"Ventanillas compartidas"]